Target
Fibroblast growth factor receptor 3
Ligand
BDBM262059
Substrate
Meas. Tech.
FGFR Enzymatic Assay 1
IC50
<10±n/a nM
Citation
 Lu, LShen, BSokolsky, AWang, XWu, LYao, WYe, Y Bicyclic heterocycles as FGFR4 inhibitors US Patent  US9708318 Publication Date 7/18/2017 
Target
Name:
Fibroblast growth factor receptor 3
Synonyms:
CD_antigen: CD333 FGFR3 Fibroblast growth factor receptor JTK4
Type:
Protein
Mol. Mass.:
87699.57
Organism:
Homo sapiens (Human)
Description:
P22607
Residue:
806
  
Inhibitor
Name:
BDBM262059
Synonyms:
5-(3-(2,6-difluoro-3,5-dimethoxyphenyl)-1-ethyl-2-oxo-1,2,3,4-tetrahydropyrido[4,3-d]pyrimidin-7-yl)-N-(2-hydroxyethyl)picolinamide US10632126, Example 177 US9708318, 177
Type:
Small organic molecule
Emp. Form.:
C25H25F2N5O5
Mol. Mass.:
513.4933
SMILES:
CCN1C(=O)N(Cc2cnc(cc12)-c1ccc(nc1)C(=O)NCCO)c1c(F)c(OC)cc(OC)c1F
: