Target
Fibroblast growth factor receptor 3
Ligand
BDBM262064
Substrate
Meas. Tech.
FGFR Enzymatic Assay 1
IC50
<10±n/a nM
Citation
 Lu, LShen, BSokolsky, AWang, XWu, LYao, WYe, Y Bicyclic heterocycles as FGFR4 inhibitors US Patent  US9708318 Publication Date 7/18/2017 
Target
Name:
Fibroblast growth factor receptor 3
Synonyms:
CD_antigen: CD333 FGFR3 Fibroblast growth factor receptor JTK4
Type:
Protein
Mol. Mass.:
87699.57
Organism:
Homo sapiens (Human)
Description:
P22607
Residue:
806
  
Inhibitor
Name:
BDBM262064
Synonyms:
3-(2,6-difluoro-3,5-dimethoxyphenyl)-1-ethyl-7-(6-morpholinopyridin-3-yl)-3,4-dihydropyrido[4,3-d]pyrimidin-2(1H)-one US10632126, Example 182 US9708318, 182
Type:
Small organic molecule
Emp. Form.:
C26H27F2N5O4
Mol. Mass.:
511.5205
SMILES:
CCN1C(=O)N(Cc2cnc(cc12)-c1ccc(nc1)N1CCOCC1)c1c(F)c(OC)cc(OC)c1F
: