Target
Indoleamine 2,3-dioxygenase 1
Ligand
BDBM24663
Substrate
BDBM21974
Meas. Tech.
Enzyme Inhibition and Ki Determination
pH
6.5±n/a
Temperature
310.15±n/a K
Ki
8900±n/a nM
IC50
4800±n/a nM
Citation
 Kumar, SJaller, DPatel, BLaLonde, JMDuHadaway, JBMalachowski, WPPrendergast, GCMuller, AJ Structure based development of phenylimidazole-derived inhibitors of indoleamine 2,3-dioxygenase. J Med Chem 51:4968-77 (2008)  
Target
Name:
Indoleamine 2,3-dioxygenase 1
Synonyms:
I23O1_HUMAN IDO-1 INDO Indoleamine 2,3-dioxygenase | Indoleamine-pyrrole 2,3-dioxygenase
Type:
Enzyme
Mol. Mass.:
45330.80
Organism:
Homo sapiens (Human)
Description:
P14902
Residue:
403
  
Inhibitor
Name:
BDBM24663
Synonyms:
2-(1H-imidazol-4-yl)phenol | 2-(1H-imidazol-4-yl)phenol, 1
Type:
Small organic molecule
Emp. Form.:
C9H8N2O
Mol. Mass.:
160.1726
SMILES:
Oc1ccccc1-c1c[nH]cn1
:
Substrate
Name:
BDBM21974
Synonyms:
(2S)-2-amino-3-(1H-indol-3-yl)propanoic acid L-tryptophan US9138393, L-Tryptophan | US9144538, L-Tryptophan
Type:
Amino Acid
Emp. Form.:
C11H12N2O2
Mol. Mass.:
204.2252
SMILES:
N[C@@H](Cc1c[nH]c2ccccc12)C(O)=O
: