Target
Serine/threonine-protein kinase pim-1
Ligand
BDBM291173
Substrate
Meas. Tech.
Enzyme Assay
IC50
<10±n/a nM
Citation
 Sun, YFeng, HLi, YMei, SPan, JWang, AYe, HZhang, K Bicyclic aromatic carboxamide compounds useful as pim kinase inhibitors US Patent  US9890162 Publication Date 2/13/2018 
Target
Name:
Serine/threonine-protein kinase pim-1
Synonyms:
PIM-1 Kinase PIM1_HUMAN Serine/threonine-protein kinase (PIM1) Serine/threonine-protein kinase PIM1 | Serine/threonine-protein kinase pim-1 (PIM1)
Type:
Protein
Mol. Mass.:
35681.82
Organism:
Homo sapiens (Human)
Description:
P11309
Residue:
313
  
Inhibitor
Name:
BDBM291173
Synonyms:
N-{4-[(3S,5R)-3-Amino-5-methylpiperidin-1-yl]pyridin-3-yl}-7-(2,6-difluorophenyl)-1,5-naphthyridine-2-carboxamide US9890162, Example 1
Type:
Small organic molecule
Emp. Form.:
C26H24F2N6O
Mol. Mass.:
474.5052
SMILES:
C[C@@H]1C[C@H](N)CN(C1)c1ccncc1NC(=O)c1ccc2ncc(cc2n1)-c1c(F)cccc1F
: