Target
Serine/threonine-protein kinase pim-1
Ligand
BDBM291196
Substrate
Meas. Tech.
Enzyme Assay
IC50
<10±n/a nM
Citation
 Sun, YFeng, HLi, YMei, SPan, JWang, AYe, HZhang, K Bicyclic aromatic carboxamide compounds useful as pim kinase inhibitors US Patent  US9890162 Publication Date 2/13/2018 
Target
Name:
Serine/threonine-protein kinase pim-1
Synonyms:
PIM-1 Kinase PIM1_HUMAN Serine/threonine-protein kinase (PIM1) Serine/threonine-protein kinase PIM1 | Serine/threonine-protein kinase pim-1 (PIM1)
Type:
Protein
Mol. Mass.:
35681.82
Organism:
Homo sapiens (Human)
Description:
P11309
Residue:
313
  
Inhibitor
Name:
BDBM291196
Synonyms:
N-{4-[(3R,4R,5S)-3-Amino-4-hydroxy-5-methylpiperidin-1-yl]pyridin-3-yl}-7-(4-cyanopiperidin-1-yl)quinoline-2-carboxamide US9890162, Example 16
Type:
Small organic molecule
Emp. Form.:
C27H31N7O2
Mol. Mass.:
485.5807
SMILES:
C[C@H]1CN(C[C@@H](N)[C@@H]1O)c1ccncc1NC(=O)c1ccc2ccc(cc2n1)N1CCC(CC1)C#N
: