Target
Serine/threonine-protein kinase pim-2
Ligand
BDBM291204
Substrate
Meas. Tech.
Enzyme Assay
IC50
<100±n/a nM
Citation
 Sun, YFeng, HLi, YMei, SPan, JWang, AYe, HZhang, K Bicyclic aromatic carboxamide compounds useful as pim kinase inhibitors US Patent  US9890162 Publication Date 2/13/2018 
Target
Name:
Serine/threonine-protein kinase pim-2
Synonyms:
PIM2 Pim-2h Serine/threonine-protein kinase PIM | Serine/threonine-protein kinase pim-2 (PIM2)
Type:
Serine/threonine-protein kinase
Mol. Mass.:
34185.93
Organism:
Homo sapiens (Human)
Description:
Q9P1W9
Residue:
311
  
Inhibitor
Name:
BDBM291204
Synonyms:
N-{4-[(3R,4R,5S)-3-Amino-4-hydroxy-5-methylpiperidin-1-yl]pyridin-3-yl}-7-(4-methoxypiperidin-1-yl)quinoline-2-carboxamide US9890162, Example 24
Type:
Small organic molecule
Emp. Form.:
C27H34N6O3
Mol. Mass.:
490.5973
SMILES:
COC1CCN(CC1)c1ccc2ccc(nc2c1)C(=O)Nc1cnccc1N1C[C@H](C)[C@@H](O)[C@H](N)C1
: