Target
Serine/threonine-protein kinase pim-2
Ligand
BDBM291208
Substrate
Meas. Tech.
Enzyme Assay
IC50
550±n/a nM
Citation
 Sun, YFeng, HLi, YMei, SPan, JWang, AYe, HZhang, K Bicyclic aromatic carboxamide compounds useful as pim kinase inhibitors US Patent  US9890162 Publication Date 2/13/2018 
Target
Name:
Serine/threonine-protein kinase pim-2
Synonyms:
PIM2 Pim-2h Serine/threonine-protein kinase PIM | Serine/threonine-protein kinase pim-2 (PIM2)
Type:
Serine/threonine-protein kinase
Mol. Mass.:
34185.93
Organism:
Homo sapiens (Human)
Description:
Q9P1W9
Residue:
311
  
Inhibitor
Name:
BDBM291208
Synonyms:
N-{4-[(3R,4R,5S)-3-Amino-4-hydroxy-5-methylpiperidin-1-yl]pyridin-3-yl}-7-[3-(trifluoromethyl)pyrrolidin-1-yl]quinoline-2-carboxamide US9890162, Example 28
Type:
Small organic molecule
Emp. Form.:
C26H29F3N6O2
Mol. Mass.:
514.5427
SMILES:
C[C@H]1CN(C[C@@H](N)[C@@H]1O)c1ccncc1NC(=O)c1ccc2ccc(cc2n1)N1CCC(C1)C(F)(F)F
: