Target
Serine/threonine-protein kinase pim-3
Ligand
BDBM291224
Substrate
Meas. Tech.
Enzyme Assay
IC50
<10±n/a nM
Citation
 Sun, YFeng, HLi, YMei, SPan, JWang, AYe, HZhang, K Bicyclic aromatic carboxamide compounds useful as pim kinase inhibitors US Patent  US9890162 Publication Date 2/13/2018 
Target
Name:
Serine/threonine-protein kinase pim-3
Synonyms:
PIM3 Serine/threonine-protein kinase pim-3 (PIM3)
Type:
Protein
Mol. Mass.:
35888.19
Organism:
Homo sapiens (Human)
Description:
Q86V86
Residue:
326
  
Inhibitor
Name:
BDBM291224
Synonyms:
N-{4-[(3R,4R,5S)-3-Amino-4-hydroxy-5-methylpiperidin-1-yl]pyridin-3-yl}-7-(1-ethyl-1H-pyrazol-4-yl)quinoline-2-carboxamide US9890162, Example 44
Type:
Small organic molecule
Emp. Form.:
C26H29N7O2
Mol. Mass.:
471.5542
SMILES:
CCn1cc(cn1)-c1ccc2ccc(nc2c1)C(=O)Nc1cnccc1N1C[C@H](C)[C@@H](O)[C@H](N)C1
: