Target
High affinity nerve growth factor receptor
Ligand
BDBM24704
Substrate
PolyEY
Meas. Tech.
TrkA Enzyme Assay
pH
7.4±n/a
Temperature
295.15±n/a K
IC50
120±n/a nM
Citation
 Wang, TLamb, MLScott, DAWang, HBlock, MHLyne, PDLee, JWDavies, AMZhang, HJZhu, YGu, FHan, YWang, BMohr, PJKaus, RJJosey, JAHoffmann, EThress, KMacintyre, TWang, HOmer, CAYu, D Identification of 4-aminopyrazolylpyrimidines as potent inhibitors of Trk kinases. J Med Chem 51:4672-84 (2008)  
Target
Name:
High affinity nerve growth factor receptor
Synonyms:
2.7.10.1 NTRK1 NTRK1_HUMAN Neurotrophic tyrosine kinase receptor type 1 Synonyms=MTC TRK1-transforming tyrosine kinase protein TRKA GN Tropomyosin alpha-3 chain/High affinity nerve growth factor receptor Tropomyosin-related kinase A (TrkA) Tyrosine kinase receptor (Trk) Tyrosine kinase receptor A (Trk A) Tyrosine kinase receptor A (TrkA) p140-TrkA
Type:
Mol. Mass.:
87498.18
Organism:
Homo sapiens (Human)
Description:
P04629
Residue:
796
  
Inhibitor
Name:
BDBM24704
Synonyms:
(2R)-2-({5-bromo-4-[(5-cyclopropyl-1H-pyrazol-3-yl)amino]pyrimidin-2-yl}amino)-2-phenylethan-1-ol | 4-aminopyrazolylpyrimidine analogue, 10j
Type:
Small organic molecule
Emp. Form.:
C18H19BrN6O
Mol. Mass.:
415.287
SMILES:
OC[C@H](Nc1ncc(Br)c(Nc2cc(n[nH]2)C2CC2)n1)c1ccccc1
:
Substrate
Name:
PolyEY
Synonyms:
Type:
Random copolymer
Mol. Mass.:
358.43
Organism:
Description:
Synthetic tyrosine residues within a generic polypeptide substrate.
Residue:
3
NA