Target
Toll-like receptor 7
Ligand
BDBM50440284
Substrate
Meas. Tech.
HEK-Blue-hTLR7 assay
EC50
800±n/a nM
Citation
 Liang, CWang, JMiao, KYun, HZheng, X Sulfonimidoylpurinone compounds and derivatives for the treatment and prophylaxis of virus infection US Patent  US9708325 Publication Date 7/18/2017 
Target
Name:
Toll-like receptor 7
Synonyms:
ORF Names:UNQ248/PRO285 TLR7_HUMAN | Toll-like receptor 7 (TLR7)
Type:
Enzyme
Mol. Mass.:
120945.35
Organism:
Homo sapiens (Human)
Description:
Q9NYK1
Residue:
1049
  
Inhibitor
Name:
BDBM50440284
Synonyms:
CHEMBL2424780 US10487084, Compound Vesatolimod US10654856, GS-9620 US10981914, Compound Vesatolimod US9708325, GS-9620
Type:
Small organic molecule
Emp. Form.:
C22H30N6O2
Mol. Mass.:
410.5126
SMILES:
CCCCOc1nc(N)c2NC(=O)CN(Cc3cccc(CN4CCCC4)c3)c2n1
: