Target
Toll-like receptor 7
Ligand
BDBM262144
Substrate
Meas. Tech.
HEK-Blue-hTLR7 assay
EC50
240±n/a nM
Citation
 Liang, CWang, JMiao, KYun, HZheng, X Sulfonimidoylpurinone compounds and derivatives for the treatment and prophylaxis of virus infection US Patent  US9708325 Publication Date 7/18/2017 
Target
Name:
Toll-like receptor 7
Synonyms:
ORF Names:UNQ248/PRO285 TLR7_HUMAN | Toll-like receptor 7 (TLR7)
Type:
Enzyme
Mol. Mass.:
120945.35
Organism:
Homo sapiens (Human)
Description:
Q9NYK1
Residue:
1049
  
Inhibitor
Name:
BDBM262144
Synonyms:
6-Amino-2-(propylsulfonimidoyl)-9-(pyrimidin-5-ylmethyl)-7H-purin-8-one US9708325, 43
Type:
Small organic molecule
Emp. Form.:
C13H16N8O2S
Mol. Mass.:
348.384
SMILES:
CCCS(=N)(=O)c1nc(N)c2[nH]c(=O)n(Cc3cncnc3)c2n1
: