Target
Epidermal growth factor receptor
Ligand
BDBM380783
Substrate
Meas. Tech.
Inhibition Assay
IC50
>1000±n/a nM
Citation
 Lan, JJin, YZhou, FLei, JWen, CZhang, ZHe, X 2,4-disubstituted 7H-pyrrolo[2,3-d]pyrimidine derivative, preparation method and medicinal use thereof US Patent  US9890168 Publication Date 2/13/2018 
Target
Name:
Epidermal growth factor receptor
Synonyms:
EGF Receptor Substrate EGFR_HUMAN ERBB1 Epidermal Growth Factor Receptor erbB-1 Epidermal growth factor receptor (EGFR) HER1 Proto-oncogene c-ErbB-1 Tyrosine-Protein Kinase ErbB-1
Type:
Receptor Kinase Domain
Mol. Mass.:
134279.59
Organism:
Homo sapiens (Human)
Description:
P00533
Residue:
1210
  
Inhibitor
Name:
BDBM380783
Synonyms:
N-(2-((2-(dimethylamino)ethyl)(methyl)amino)-4-methoxy-5-(4(1-methyl-1H-pyrazol-4-yl)-7H-pyrrolo[2,3-d]pyrimidn-2-ylamino)phenyl)acrylamide US9890168, Compound 9
Type:
Small organic molecule
Emp. Form.:
C25H31N9O2
Mol. Mass.:
489.5727
SMILES:
COc1cc(N(C)CCN(C)C)c(NC(=O)C=C)cc1Nc1nc(-c2cnn(C)c2)c2cc[nH]c2n1
: