Target
Epidermal growth factor receptor [T790M,L858R]
Ligand
BDBM380798
Substrate
Meas. Tech.
Inhibition Assay
IC50
1002±n/a nM
Citation
 Lan, JJin, YZhou, FLei, JWen, CZhang, ZHe, X 2,4-disubstituted 7H-pyrrolo[2,3-d]pyrimidine derivative, preparation method and medicinal use thereof US Patent  US9890168 Publication Date 2/13/2018 
Target
Name:
Epidermal growth factor receptor [T790M,L858R]
Synonyms:
EGFR EGFR_HUMAN ERBB1 Epidermal growth factor receptor (EGFR)(T790M/L858R) Epidermal growth factor receptor (T790M, L858R) Epidermal growth factor receptor(L858R, T790M) | HER1
Type:
Mol. Mass.:
134353.72
Organism:
Homo sapiens (Human)
Description:
P00533[T790M,L858R]
Residue:
1210
  
Inhibitor
Name:
BDBM380798
Synonyms:
US9890168, Compound Comparative compound 1
Type:
Small organic molecule
Emp. Form.:
C27H31N7O2
Mol. Mass.:
485.5807
SMILES:
COc1cc(ccc1Nc1nc(-c2cccc(NC(=O)C=C)c2)c2cc[nH]c2n1)N(C)CCN(C)C
: