Target
Cytochrome P450 11B2, mitochondrial
Ligand
BDBM380864
Substrate
Meas. Tech.
Inhibition Assay
IC50
15.9±n/a nM
Citation
 Chen, ZCogan, DGuo, XMarshall, DRMeyers, KMZhang, Y Aldosterone synthase inhibitors US Patent  US9890171 Publication Date 2/13/2018 
Target
Name:
Cytochrome P450 11B2, mitochondrial
Synonyms:
Aldosterone Synthase (CYP11B2) Aldosterone-synthesizing enzyme CYP11B2 Cytochrome P450 11B2 Cytochrome P450 11B2, mitochondrial P-450C18 | Steroid 18-hydroxylase
Type:
Protein
Mol. Mass.:
57582.15
Organism:
Homo sapiens (Human)
Description:
P19099
Residue:
503
  
Inhibitor
Name:
BDBM380864
Synonyms:
Ethanesulfonic acid [8-(3-fluoro-1- methyl-1H-indazol-6-yl)-3,4-dihydro- 1H-pyrano[4,3-c]pyridin-4-yl]-amide, Enantiomer II | US9890171, 68
Type:
Small organic molecule
Emp. Form.:
C18H19FN4O3S
Mol. Mass.:
390.432
SMILES:
CCS(=O)(=O)NC1COCc2c1cncc2-c1ccc2c(F)nn(C)c2c1
: