Target
Cytochrome P450 11B2, mitochondrial
Ligand
BDBM380945
Substrate
Meas. Tech.
Inhibition Assay
IC50
17.3±n/a nM
Citation
 Chen, ZCogan, DGuo, XMarshall, DRMeyers, KMZhang, Y Aldosterone synthase inhibitors US Patent  US9890171 Publication Date 2/13/2018 
Target
Name:
Cytochrome P450 11B2, mitochondrial
Synonyms:
Aldosterone Synthase (CYP11B2) Aldosterone-synthesizing enzyme CYP11B2 Cytochrome P450 11B2 Cytochrome P450 11B2, mitochondrial P-450C18 | Steroid 18-hydroxylase
Type:
Protein
Mol. Mass.:
57582.15
Organism:
Homo sapiens (Human)
Description:
P19099
Residue:
503
  
Inhibitor
Name:
BDBM380945
Synonyms:
8-(4-Fluoro-1-methyl-1H-indazol-6- yl)-3,4-dihydro-1H- pyrano[4,3-c]pyridin-4-ylamine, Enantiomer II | US9890171, 149
Type:
Small organic molecule
Emp. Form.:
C16H15FN4O
Mol. Mass.:
298.3149
SMILES:
Cn1ncc2c(F)cc(cc12)-c1cncc2C(N)COCc12
: