Target
Cytochrome P450 11B2, mitochondrial
Ligand
BDBM380973
Substrate
Meas. Tech.
Inhibition Assay
IC50
15.0±n/a nM
Citation
 Chen, ZCogan, DGuo, XMarshall, DRMeyers, KMZhang, Y Aldosterone synthase inhibitors US Patent  US9890171 Publication Date 2/13/2018 
Target
Name:
Cytochrome P450 11B2, mitochondrial
Synonyms:
Aldosterone Synthase (CYP11B2) Aldosterone-synthesizing enzyme CYP11B2 Cytochrome P450 11B2 Cytochrome P450 11B2, mitochondrial P-450C18 | Steroid 18-hydroxylase
Type:
Protein
Mol. Mass.:
57582.15
Organism:
Homo sapiens (Human)
Description:
P19099
Residue:
503
  
Inhibitor
Name:
BDBM380973
Synonyms:
6-(4-Hydroxy-4-methyl-3,4-dihydro- 1H-pyrano[4,3-c]pyridin-8-yl)-1- methyl-1H-indazole-3-carbonitrile, Enantiomer I US9890171, 178
Type:
Small organic molecule
Emp. Form.:
C18H16N4O2
Mol. Mass.:
320.3452
SMILES:
Cn1nc(C#N)c2ccc(cc12)-c1cncc2c1COCC2(C)O
: