Target
Mitogen-activated protein kinase kinase kinase 9
Ligand
BDBM24952
Substrate
myelin basic protein
Meas. Tech.
Mixed-Lineage Kinase Assay
pH
7.2±n/a
Temperature
310.15±n/a K
IC50
49±n/a nM
Citation
 Hudkins, RLDiebold, JLTao, MJosef, KAPark, CHAngeles, TSAimone, LDHusten, JAtor, MAMeyer, SLHolskin, BPDurkin, JTFedorov, AAFedorov, EVAlmo, SCMathiasen, JRBozyczko-Coyne, DSaporito, MSScott, RWMallamo, JP Mixed-lineage kinase 1 and mixed-lineage kinase 3 subtype-selective dihydronaphthyl[3,4-a]pyrrolo[3,4-c]carbazole-5-ones: optimization, mixed-lineage kinase 1 crystallography, and oral in vivo activity in 1-methyl-4-phenyltetrahydropyridine models. J Med Chem 51:5680-9 (2008)  
Target
Name:
Mitogen-activated protein kinase kinase kinase 9
Synonyms:
M3K9_HUMAN MLK1 Mitogen-activated protein kinase kinase kinase 9 (MLK1) PRKE1
Type:
protein
Mol. Mass.:
121881.51
Organism:
Homo sapiens (Human)
Description:
P80192
Residue:
1104
  
Inhibitor
Name:
BDBM24952
Synonyms:
20-(cyclopentyloxy)-3-(2-hydroxyethyl)-3,13-diazahexacyclo[14.8.0.0^{2,10}.0^{4,9}.0^{11,15}.0^{17,22}]tetracosa-1(16),2(10),4(9),5,7,11(15),17(22),18,20-nonaen-14-one | 5-oxo dihydronaphthylcarbazole analogue, 19
Type:
Small organic molecule
Emp. Form.:
C29H28N2O3
Mol. Mass.:
452.5442
SMILES:
OCCn1c2ccccc2c2c3CNC(=O)c3c-3c(CCc4cc(OC5CCCC5)ccc-34)c12
:
Substrate
Name:
myelin basic protein
Synonyms:
MBP Myelin A1 protein biotin-MBP protein | biotin-myelin basic protein
Type:
Other Protein Type
Mol. Mass.:
33133.33
Organism:
Homo sapiens (Human)
Description:
Residue:
304