Target
High affinity nerve growth factor receptor
Ligand
BDBM24947
Substrate
GST-PLC-gamma
IC50
1270±n/a nM
Citation
 Hudkins, RLDiebold, JLTao, MJosef, KAPark, CHAngeles, TSAimone, LDHusten, JAtor, MAMeyer, SLHolskin, BPDurkin, JTFedorov, AAFedorov, EVAlmo, SCMathiasen, JRBozyczko-Coyne, DSaporito, MSScott, RWMallamo, JP Mixed-lineage kinase 1 and mixed-lineage kinase 3 subtype-selective dihydronaphthyl[3,4-a]pyrrolo[3,4-c]carbazole-5-ones: optimization, mixed-lineage kinase 1 crystallography, and oral in vivo activity in 1-methyl-4-phenyltetrahydropyridine models. J Med Chem 51:5680-9 (2008)  
Target
Name:
High affinity nerve growth factor receptor
Synonyms:
2.7.10.1 NTRK1 NTRK1_HUMAN Neurotrophic tyrosine kinase receptor type 1 Synonyms=MTC TRK1-transforming tyrosine kinase protein TRKA GN Trk-A Tropomyosin-related kinase A Tyrosine kinase receptor Tyrosine kinase receptor A Tyrosine kinase receptor A (Trk-A) gp140trk | p140-TrkA
Type:
Mol. Mass.:
87498.18
Organism:
Homo sapiens (Human)
Description:
P04629
Residue:
796
  
Inhibitor
Name:
BDBM24947
Synonyms:
3-(2-hydroxyethyl)-20-methoxy-3,13-diazahexacyclo[14.8.0.0^{2,10}.0^{4,9}.0^{11,15}.0^{17,22}]tetracosa-1(16),2(10),4(9),5,7,11(15),17(22),18,20-nonaen-14-one | 5-oxo dihydronaphthylcarbazole analogue, 14
Type:
Small organic molecule
Emp. Form.:
C25H22N2O3
Mol. Mass.:
398.4538
SMILES:
COc1ccc-2c(CCc3c-2c2C(=O)NCc2c2c4ccccc4n(CCO)c32)c1
:
Substrate
Name:
GST-PLC-gamma
Synonyms:
Glutathione S-Transferase-Phospholipase C-gamma-SH2
Type:
Other Protein Type
Mol. Mass.:
24222.24
Organism:
Homo sapiens (Human)
Description:
P19174[550-756]
Residue:
207