Target
Proto-oncogene tyrosine-protein kinase Src
Ligand
BDBM381126
Substrate
Meas. Tech.
Enzyme Inhibition Assay
IC50
12.0±n/a nM
Citation
 Fyfe, MCThom, SMBaker, TMHarbottle, GWHasimbegovic, VRigby, A Urea derivatives useful as kinase inhibitors US Patent  US9890185 Publication Date 2/13/2018 
Target
Name:
Proto-oncogene tyrosine-protein kinase Src
Synonyms:
Calmodulin/Proto-oncogene tyrosine-protein kinase Src Proto-oncogene c-Src SRC SRC_HUMAN V-src sarcoma (Schmidt-Ruppin A-2) viral oncogene homolog (avian) p60-Src | pp60c-src
Type:
Protein
Mol. Mass.:
59838.60
Organism:
Homo sapiens (Human)
Description:
P12931
Residue:
536
  
Inhibitor
Name:
BDBM381126
Synonyms:
3-((4-((4-(3-(3-(2-Amino-2-oxoethyl)-5-(tert-butyl)-2-methoxyphenyl)ureido)naphthalen-1-yl)oxy)pyridin-2-yl)amino)-5-methoxy-N-(2-morpholinoethyl)benzamide | US9890185, Example 45
Type:
Small organic molecule
Emp. Form.:
C43H49N7O7
Mol. Mass.:
775.8919
SMILES:
COc1cc(Nc2cc(Oc3ccc(NC(=O)Nc4cc(cc(CC(N)=O)c4OC)C(C)(C)C)c4ccccc34)ccn2)cc(c1)C(=O)NCCN1CCOCC1
: