Target
Urease subunit alpha [F36L]/beta/gamma
Ligand
BDBM24963
Substrate
BDBM24961
Meas. Tech.
Enzyme Inhibition Assay
pH
7±n/a
Temperature
303.15±n/a K
Ki
208000±7000 nM
IC50
617000±17000 nM
Citation
 Vassiliou, SGrabowiecka, AKosikowska, PYiotakis, AKafarski, PBerlicki, L Design, synthesis, and evaluation of novel organophosphorus inhibitors of bacterial ureases. J Med Chem 51:5736-44 (2008)  
Target
Name:
Urease subunit alpha [F36L]/beta/gamma
Synonyms:
Urea Amidohydrolase Urease
Type:
Heterotrimer of ureA, ureB and ureC subunits. Three heterotrimers associate to form the active enzyme.
Mol. Mass.:
Description:
Components:
This complex has 3 components.
Component 1
Name:
Urease subunit alpha [F36L]
Synonyms:
URE1_PROMH ureC
Type:
Enzyme Subunit
Mol. Mass.:
60882.75
Organism:
Proteus vulgaris
Description:
P17086[F36L]
Residue:
567
  
Component 2
Name:
Urease subunit beta
Synonyms:
UreB | Urea Amidohydrolase Subunit beta
Type:
Enzyme Subunit
Mol. Mass.:
12029.52
Organism:
Proteus vulgaris
Description:
Residue:
108
  
Component 3
Name:
Urease subunit gamma
Synonyms:
UreA | Urea Amidohydrolase Subunit gamma
Type:
Mol. Mass.:
10908.21
Organism:
Proteus vulgaris
Description:
Residue:
100
  
Inhibitor
Name:
BDBM24963
Synonyms:
organophosphorus derivative, 4 | {[(2S)-2-amino-3-methylbutanamido]methyl}(methyl)phosphinic acid
Type:
Small organic molecule
Emp. Form.:
C7H17N2O3P
Mol. Mass.:
208.1952
SMILES:
CC(C)[C@H](N)C(=O)NCP(C)(O)=O
:
Substrate
Name:
BDBM24961
Synonyms:
Urea
Type:
Small organic molecule
Emp. Form.:
CH4N2O
Mol. Mass.:
60.0553
SMILES:
NC(N)=O
: