Target
Urease subunit alpha [F36L]/beta/gamma
Ligand
BDBM24965
Substrate
BDBM24961
Meas. Tech.
Enzyme Inhibition Assay
pH
7±n/a
Temperature
303.15±n/a K
Ki
32600±1200 nM
IC50
183000±11000 nM
Citation
 Vassiliou, SGrabowiecka, AKosikowska, PYiotakis, AKafarski, PBerlicki, L Design, synthesis, and evaluation of novel organophosphorus inhibitors of bacterial ureases. J Med Chem 51:5736-44 (2008)  
Target
Name:
Urease subunit alpha [F36L]/beta/gamma
Synonyms:
Urea Amidohydrolase Urease
Type:
Heterotrimer of ureA, ureB and ureC subunits. Three heterotrimers associate to form the active enzyme.
Mol. Mass.:
Description:
Components:
This complex has 3 components.
Component 1
Name:
Urease subunit alpha [F36L]
Synonyms:
URE1_PROMH ureC
Type:
Enzyme Subunit
Mol. Mass.:
60882.75
Organism:
Proteus vulgaris
Description:
P17086[F36L]
Residue:
567
  
Component 2
Name:
Urease subunit beta
Synonyms:
UreB | Urea Amidohydrolase Subunit beta
Type:
Enzyme Subunit
Mol. Mass.:
12029.52
Organism:
Proteus vulgaris
Description:
Residue:
108
  
Component 3
Name:
Urease subunit gamma
Synonyms:
UreA | Urea Amidohydrolase Subunit gamma
Type:
Mol. Mass.:
10908.21
Organism:
Proteus vulgaris
Description:
Residue:
100
  
Inhibitor
Name:
BDBM24965
Synonyms:
organophosphorus derivative, 6 | {[(2S)-2-amino-3-(benzyloxy)propanamido]methyl}(methyl)phosphinic acid
Type:
Small organic molecule
Emp. Form.:
C12H19N2O4P
Mol. Mass.:
286.264
SMILES:
CP(O)(=O)CNC(=O)[C@@H](N)COCc1ccccc1
:
Substrate
Name:
BDBM24961
Synonyms:
Urea
Type:
Small organic molecule
Emp. Form.:
CH4N2O
Mol. Mass.:
60.0553
SMILES:
NC(N)=O
: