Target
RAC-gamma serine/threonine-protein kinase
Ligand
BDBM24992
Substrate
AKT Substrate Peptide
Meas. Tech.
In Vitro Kinase Inhibition Assay
IC50
1549±n/a nM
Citation
 Heerding, DARhodes, NLeber, JDClark, TJKeenan, RMLafrance, LVLi, MSafonov, IGTakata, DTVenslavsky, JWYamashita, DSChoudhry, AECopeland, RALai, ZSchaber, MDTummino, PJStrum, SLWood, ERDuckett, DREberwein, DKnick, VBLansing, TJMcConnell, RTZhang, SMinthorn, EAConcha, NOWarren, GLKumar, R Identification of 4-(2-(4-amino-1,2,5-oxadiazol-3-yl)-1-ethyl-7-{[(3S)-3-piperidinylmethyl]oxy}-1H-imidazo[4,5-c]pyridin-4-yl)-2-methyl-3-butyn-2-ol (GSK690693), a novel inhibitor of AKT kinase. J Med Chem 51:5663-79 (2008)  
Target
Name:
RAC-gamma serine/threonine-protein kinase
Synonyms:
AKT3 PKB gamma Protein kinase Akt-3 Protein kinase B, gamma RAC-gamma serine/threonine-protein kinase Serine/threonine-protein kinase AKT | Serine/threonine-protein kinase AKT3
Type:
Enzyme
Mol. Mass.:
55769.36
Organism:
Homo sapiens (Human)
Description:
Residue:
479
  
Inhibitor
Name:
BDBM24992
Synonyms:
4-[1-ethyl-7-(piperazin-1-ylcarbonyl)-1H-imidazo[4,5-c]pyridin-2-yl]-1,2,5-oxadiazol-3-amine | oxadiazole-containing compound, 5
Type:
Small organic molecule
Emp. Form.:
C15H18N8O2
Mol. Mass.:
342.3558
SMILES:
CCn1c(nc2cncc(C(=O)N3CCNCC3)c12)-c1nonc1N
:
Substrate
Name:
AKT Substrate Peptide
Synonyms:
Type:
Peptide
Mol. Mass.:
1689.88
Organism:
Description:
Residue:
14
ARKRERAYSFGHHA