Target
Ribosomal protein S6 kinase alpha-1
Ligand
BDBM24997
Substrate
ROCK1 Substrate Peptide
Meas. Tech.
In Vitro Kinase Inhibition Assay
IC50
44±n/a nM
Citation
 Heerding, DARhodes, NLeber, JDClark, TJKeenan, RMLafrance, LVLi, MSafonov, IGTakata, DTVenslavsky, JWYamashita, DSChoudhry, AECopeland, RALai, ZSchaber, MDTummino, PJStrum, SLWood, ERDuckett, DREberwein, DKnick, VBLansing, TJMcConnell, RTZhang, SMinthorn, EAConcha, NOWarren, GLKumar, R Identification of 4-(2-(4-amino-1,2,5-oxadiazol-3-yl)-1-ethyl-7-{[(3S)-3-piperidinylmethyl]oxy}-1H-imidazo[4,5-c]pyridin-4-yl)-2-methyl-3-butyn-2-ol (GSK690693), a novel inhibitor of AKT kinase. J Med Chem 51:5663-79 (2008)  
Target
Name:
Ribosomal protein S6 kinase alpha-1
Synonyms:
90 kDa ribosomal protein S6 kinase 1 MAP kinase-activated protein kinase 1a RPS6KA1 RPS6KA1(Kin.Dom.2 - C-terminal) RSK1 Ribosomal S6 kinase 1 Ribosomal protein S6 kinase alpha 1 Ribosomal protein S6 kinase alpha-1 (RSK1) p90-RSK 1 p90S6K | pp90RSK1
Type:
Serine/threonine-protein kinase
Mol. Mass.:
82736.10
Organism:
Homo sapiens (Human)
Description:
Residue:
735
  
Inhibitor
Name:
BDBM24997
Synonyms:
4-[7-(3-aminopropoxy)-1-ethyl-4-phenyl-1H-imidazo[4,5-c]pyridin-2-yl]-1,2,5-oxadiazol-3-amine oxadiazole-containing compound, 10
Type:
Small organic molecule
Emp. Form.:
C19H21N7O2
Mol. Mass.:
379.4157
SMILES:
CCn1c(nc2c(ncc(OCCCN)c12)-c1ccccc1)-c1nonc1N
:
Substrate
Name:
ROCK1 Substrate Peptide
Synonyms:
RSK1 Substrate Peptide
Type:
Peptide
Mol. Mass.:
1318.60
Organism:
Description:
Residue:
11
AKRRRLSSLRA