Target
Glucocorticoid receptor
Ligand
BDBM381373
Substrate
Meas. Tech.
Biological Evaluation
IC50
<50±n/a nM
Citation
 Pinkerton, ABHassig, CAJackson, MRArdecky, RJPass, I Inhibitors of glucocorticoid receptor translocation US Patent  US10272074 Publication Date 4/30/2019 
Target
Name:
Glucocorticoid receptor
Synonyms:
GCR_HUMAN GRL Glucocorticoid receptor (GRFP) Nuclear receptor subfamily 3 group C member 1
Type:
Enzyme
Mol. Mass.:
85656.87
Organism:
Homo sapiens (Human)
Description:
P04150
Residue:
777
  
Inhibitor
Name:
BDBM381373
Synonyms:
4-Chloro-1-(1-ethyl-piperidin-4- yl)-1H-pyrazolo[3,4-b]pyridine-5- carboxylic acid (4-trifluoromethyl- phenyl)-amide | US10272074, Example 206
Type:
Small organic molecule
Emp. Form.:
C21H21ClF3N5O
Mol. Mass.:
451.873
SMILES:
CCN1CCC(CC1)n1ncc2c(Cl)c(cnc12)C(=O)Nc1ccc(cc1)C(F)(F)F
: