Target
Glucocorticoid receptor
Ligand
BDBM381464
Substrate
Meas. Tech.
Biological Evaluation
IC50
<50±n/a nM
Citation
 Pinkerton, ABHassig, CAJackson, MRArdecky, RJPass, I Inhibitors of glucocorticoid receptor translocation US Patent  US10272074 Publication Date 4/30/2019 
Target
Name:
Glucocorticoid receptor
Synonyms:
GCR_HUMAN GRL Glucocorticoid receptor (GRFP) Nuclear receptor subfamily 3 group C member 1
Type:
Enzyme
Mol. Mass.:
85656.87
Organism:
Homo sapiens (Human)
Description:
P04150
Residue:
777
  
Inhibitor
Name:
BDBM381464
Synonyms:
4-chloro-N-(4-isopropylphenyl)-1- ((1-methyl-1H-imidazol-5- yl)methyl)-1H-pyrazolo[3,4- b]pyridine-5-carboxamide | US10272074, Example 299
Type:
Small organic molecule
Emp. Form.:
C21H21ClN6O
Mol. Mass.:
408.884
SMILES:
CC(C)c1ccc(NC(=O)c2cnc3n(Cc4cncn4C)ncc3c2Cl)cc1
: