Target
Sodium/hydrogen exchanger 3
Ligand
BDBM381690
Substrate
Meas. Tech.
Cell-based activity under Prompt Conditions
IC50
4.47±n/a nM
Citation
 Carreras, CCharmot, DJacobs, JWLabonte, ELewis, JG NHE3-binding compounds and methods for inhibiting phosphate transport US Patent  US10272079 Publication Date 4/30/2019 
Target
Name:
Sodium/hydrogen exchanger 3
Synonyms:
NHE3 SLC9A3
Type:
PROTEIN
Mol. Mass.:
92861.96
Organism:
Homo sapiens (Human)
Description:
ChEMBL_141050
Residue:
834
  
Inhibitor
Name:
BDBM381690
Synonyms:
US10272079, Compound 47 | US10272079, Compound 66
Type:
Small organic molecule
Emp. Form.:
C58H82N8O12S2
Mol. Mass.:
1147.448
SMILES:
O=C(NCCCCNC(=O)NCCOCCOCCNS(=O)(=O)c1ccc(O[C@@H]2[C@H](Cc3ccccc23)N2CCCCC2)cc1)NCCOCCOCCNS(=O)(=O)c1ccc(O[C@@H]2[C@H](Cc3ccccc23)N2CCCCC2)cc1
: