Target
Fibroblast growth factor receptor 4
Ligand
BDBM381836
Substrate
Meas. Tech.
FGFR4 (Enzymatic Assay)
IC50
501±n/a nM
Citation
 Saxty, GHamlett, CCBerdini, VMurray, CWAngibaud, PRQuerolle, OAPoncelet, VS Pteridines as FGFR inhibitors US Patent  US10272087 Publication Date 4/30/2019 
Target
Name:
Fibroblast growth factor receptor 4
Synonyms:
CD_antigen: CD334 FGFR4 FGFR4 Fibroblast growth factor receptor JK2 TKF
Type:
Protein
Mol. Mass.:
87957.45
Organism:
Homo sapiens (Human)
Description:
P22455
Residue:
802
  
Inhibitor
Name:
BDBM381836
Synonyms:
US10272087, Compound 10
Type:
Small organic molecule
Emp. Form.:
C23H23FN8O3
Mol. Mass.:
478.4789
SMILES:
COc1cc(OC)c(F)c(c1)N(C[C@H]1CCC(=O)N1)c1ncc2ncc(nc2n1)-c1cnn(C)c1
: