Target
NAD(P)H dehydrogenase [quinone] 1
Ligand
BDBM381895
Substrate
Meas. Tech.
BEAS-2B NQO1 MTT Assay
EC50
550±n/a nM
Citation
 Kerns, JKCallahan, JFYan, HHeightman, TDBoehm, JCWoolford, AJ NRF2 regulators US Patent  US10272095 Publication Date 4/30/2019 
Target
Name:
NAD(P)H dehydrogenase [quinone] 1
Synonyms:
Azoreductase DT-diaphorase NAD(P)H:quinone oxidoreductase 1 NQO1 Phylloquinone reductase Quinone Reductase 1 | Quinone reductase 1)
Type:
Homodimer
Mol. Mass.:
30874.82
Organism:
Homo sapiens (Human)
Description:
Residue:
274
  
Inhibitor
Name:
BDBM381895
Synonyms:
3-{1-[(tert-Butoxy)carbonyl]-1H,2H,3H,3aH,4H,8bH-indeno[1,2-b]pyrrol-7-yl}-3-(7-methoxy-1-methyl-1H-1,2,3-benzotriazol-5-yl)propanoic Acid | US10272095, Example 15
Type:
Small organic molecule
Emp. Form.:
C27H32N4O5
Mol. Mass.:
492.5668
SMILES:
COc1cc(cc2nnn(C)c12)C(CC(O)=O)c1ccc2CC3CCN(C3c2c1)C(=O)OC(C)(C)C
: