Target
Serine/threonine-protein kinase PLK4
Ligand
BDBM25116
Substrate
Biotinylated Peptide A-A11
Meas. Tech.
PLK Kinase Assay
Ki
790±n/a nM
Citation
 Johnson, EFStewart, KDWoods, KWGiranda, VLLuo, Y Pharmacological and functional comparison of the polo-like kinase family: insight into inhibitor and substrate specificity. Biochemistry 46:9551-63 (2007)  
Target
Name:
Serine/threonine-protein kinase PLK4
Synonyms:
PLK4 Polo-Like Kinase 4 STK18 | Serine/threonine-protein kinase PLK4
Type:
PROTEIN
Mol. Mass.:
108996.91
Organism:
Homo sapiens (Human)
Description:
ChEMBL_1474078
Residue:
970
  
Inhibitor
Name:
BDBM25116
Synonyms:
1-tert-butyl-3-(4-methylphenyl)-1H-pyrazolo[3,4-d]pyrimidin-4-amine PP1 US10807986, Comparative compound 1 US11701353, PP1 (Pfizer) | cid_1400
Type:
Small organic molecule
Emp. Form.:
C16H19N5
Mol. Mass.:
281.3556
SMILES:
Cc1ccc(cc1)-c1nn(c2ncnc(N)c12)C(C)(C)C
:
Substrate
Name:
Biotinylated Peptide A-A11
Synonyms:
Type:
Peptide
Mol. Mass.:
1379.40
Organism:
Description:
Residue:
13
TPSDSLIYDDGLS