Target
Vascular endothelial growth factor receptor 1
Ligand
BDBM381928
Substrate
Meas. Tech.
Kinase Dilution
IC50
2750±n/a nM
Citation
 Aftab, DTNaganathan, SXu, WLacy, SNguyen, L Metabolites of N-{4-([6,7-bis(methyloxy)quinolin-4-yl]oxy}phenyl)-N′-(4-fluorophenyl)cyclopropane-1,1-dicarboxamide US Patent  US10273211 Publication Date 4/30/2019 
Target
Name:
Vascular endothelial growth factor receptor 1
Synonyms:
FLT FRT Fms-like tyrosine kinase 1 Tyrosine-protein kinase FRT VEGFR-1 VGFR1_HUMAN Vascular endothelial growth factor receptor 1 (FLT1) Vascular endothelial growth factor receptor 1 and 2 (Flt-1 and KDR) Vascular permeability factor receptor vascular endothelial growth factor/vascular permeability factor receptor
Type:
Receptor Tyrosine Kinase
Mol. Mass.:
150800.23
Organism:
Homo sapiens (Human)
Description:
P17948
Residue:
1338
  
Inhibitor
Name:
BDBM381928
Synonyms:
US10273211, Compound 13
Type:
Small organic molecule
Emp. Form.:
C28H24FN3O6
Mol. Mass.:
517.5051
SMILES:
COc1cc2nccc(Oc3ccc(NC(=O)C4(CC4)C(=O)Nc4ccc(F)c(O)c4)cc3)c2cc1OC
: