Target
Glutamate receptor ionotropic, NMDA 2D
Ligand
BDBM50436101
Substrate
IC50
1000±n/a nM
Citation
 Traynelis, SFLiotta, DCSantangelo, RMGarnier, EC Subunit selective NMDA receptor potentiators for the treatment of neurological conditions US Patent  US10273214 Publication Date 4/30/2019 
Target
Name:
Glutamate receptor ionotropic, NMDA 2D
Synonyms:
GRIN2D Glutamate [NMDA] receptor subunit epsilon 4 NMDAR2D | NMDE4_HUMAN
Type:
PROTEIN
Mol. Mass.:
143780.23
Organism:
Homo sapiens (Human)
Description:
ChEMBL_983632
Residue:
1336
  
Inhibitor
Name:
BDBM50436101
Synonyms:
CHEMBL2397257 | US10273214, Example 1180-27
Type:
Small organic molecule
Emp. Form.:
C25H24BrNO4
Mol. Mass.:
482.366
SMILES:
COc1ccc(OCC2N(CCc3cc(OC)ccc23)C(=O)c2cccc(Br)c2)cc1
: