Target
Glutamate receptor ionotropic, NMDA 2D
Ligand
BDBM381960
Substrate
IC50
44000±n/a nM
Citation
 Traynelis, SFLiotta, DCSantangelo, RMGarnier, EC Subunit selective NMDA receptor potentiators for the treatment of neurological conditions US Patent  US10273214 Publication Date 4/30/2019 
Target
Name:
Glutamate receptor ionotropic, NMDA 2D
Synonyms:
GRIN2D Glutamate [NMDA] receptor subunit epsilon 4 NMDAR2D | NMDE4_HUMAN
Type:
PROTEIN
Mol. Mass.:
143780.23
Organism:
Homo sapiens (Human)
Description:
ChEMBL_983632
Residue:
1336
  
Inhibitor
Name:
BDBM381960
Synonyms:
US10273214, Example 1406
Type:
Small organic molecule
Emp. Form.:
C22H21NO3S
Mol. Mass.:
379.472
SMILES:
CC(C)(C)c1ccc(cc1)C(=O)Nc1scc(c1C(O)=O)-c1ccccc1
: