Target
Glutamate receptor ionotropic, NMDA 2D
Ligand
BDBM53433
Substrate
IC50
43000±n/a nM
Citation
 Traynelis, SFLiotta, DCSantangelo, RMGarnier, EC Subunit selective NMDA receptor potentiators for the treatment of neurological conditions US Patent  US10273214 Publication Date 4/30/2019 
Target
Name:
Glutamate receptor ionotropic, NMDA 2D
Synonyms:
GRIN2D Glutamate [NMDA] receptor subunit epsilon 4 NMDAR2D | NMDE4_HUMAN
Type:
PROTEIN
Mol. Mass.:
143780.23
Organism:
Homo sapiens (Human)
Description:
ChEMBL_983632
Residue:
1336
  
Inhibitor
Name:
BDBM53433
Synonyms:
2-[(4-tert-butylbenzoyl)amino]-4-(4-methoxyphenyl)-3-thenoic acid 2-[(4-tert-butylbenzoyl)amino]-4-(4-methoxyphenyl)thiophene-3-carboxylic acid 2-[[(4-tert-butylphenyl)-oxomethyl]amino]-4-(4-methoxyphenyl)-3-thiophenecarboxylic acid Nonacylated oxime, 22 US10273214, Example 1424 | cid_1724256
Type:
Small organic molecule
Emp. Form.:
C23H23NO4S
Mol. Mass.:
409.498
SMILES:
COc1ccc(cc1)-c1csc(NC(=O)c2ccc(cc2)C(C)(C)C)c1C(O)=O
: