Target
Lysine-specific demethylase 5A
Ligand
BDBM381945
Substrate
Meas. Tech.
Jarid1A Assay
IC50
<100±n/a nM
Citation
 Kanouni, TNie, ZStafford, JAVeal, JM Histone demethylase inhibitors US Patent  US10273222 Publication Date 4/30/2019 
Target
Name:
Lysine-specific demethylase 5A
Synonyms:
Histone demethylase JARID1A Jumonji/ARID domain-containing protein 1A KDM5A_HUMAN RBBP-2 RBP2 | Retinoblastoma-binding protein 2
Type:
Protein
Mol. Mass.:
192091.79
Organism:
Homo sapiens (Human)
Description:
P29375
Residue:
1690
  
Inhibitor
Name:
BDBM381945
Synonyms:
2-(5-{4-[1- (hydroxymethyl)cyclopropyl]- phenyl}-1-methyl-1H-imidazol-4- yl)pyridine-4-carboxylic acid | US10273222, Example 17
Type:
Small organic molecule
Emp. Form.:
C20H19N3O3
Mol. Mass.:
349.3832
SMILES:
Cn1cnc(c1-c1ccc(cc1)C1(CO)CC1)-c1cc(ccn1)C(O)=O
: