Target
Lysine-specific demethylase 5B
Ligand
BDBM381983
Substrate
Meas. Tech.
Jarid1B Assay
IC50
<100±n/a nM
Citation
 Kanouni, TNie, ZStafford, JAVeal, JM Histone demethylase inhibitors US Patent  US10273222 Publication Date 4/30/2019 
Target
Name:
Lysine-specific demethylase 5B
Synonyms:
CT31 Histone demethylase JARID1B Jumonji/ARID domain-containing protein 1B KDM5B_HUMAN Lysine-specific demethylase 5B (KDM5Flag-5B-FL) PLU1 RBP2-H1 | Retinoblastoma-binding protein 2 homolog 1
Type:
Protein
Mol. Mass.:
175659.67
Organism:
Homo sapiens (Human)
Description:
Q9UGL1
Residue:
1544
  
Inhibitor
Name:
BDBM381983
Synonyms:
2-(1-propyl-1H-imidazol-4- yl)pyridine-4-carboxylic acid | US10273222, Example 41
Type:
Small organic molecule
Emp. Form.:
C12H13N3O2
Mol. Mass.:
231.2505
SMILES:
CCCn1cnc(c1)-c1cc(ccn1)C(O)=O
: