Target
Lysine-specific demethylase 5A
Ligand
BDBM382052
Substrate
Meas. Tech.
Jarid1A Assay
IC50
<100±n/a nM
Citation
 Kanouni, TNie, ZStafford, JAVeal, JM Histone demethylase inhibitors US Patent  US10273222 Publication Date 4/30/2019 
Target
Name:
Lysine-specific demethylase 5A
Synonyms:
Histone demethylase JARID1A Jumonji/ARID domain-containing protein 1A KDM5A_HUMAN RBBP-2 RBP2 | Retinoblastoma-binding protein 2
Type:
Protein
Mol. Mass.:
192091.79
Organism:
Homo sapiens (Human)
Description:
P29375
Residue:
1690
  
Inhibitor
Name:
BDBM382052
Synonyms:
2-[1-(2-naphthalen-1- ylethyl)imidazol-4-yl]pyridine-4- carboxylic acid | US10273222, Example 112
Type:
Small organic molecule
Emp. Form.:
C21H17N3O2
Mol. Mass.:
343.3786
SMILES:
OC(=O)c1ccnc(c1)-c1cn(CCc2cccc3ccccc23)cn1
: