Target
Lysine-specific demethylase 5B
Ligand
BDBM382056
Substrate
Meas. Tech.
Jarid1B Assay
IC50
<100±n/a nM
Citation
 Kanouni, TNie, ZStafford, JAVeal, JM Histone demethylase inhibitors US Patent  US10273222 Publication Date 4/30/2019 
Target
Name:
Lysine-specific demethylase 5B
Synonyms:
CT31 Histone demethylase JARID1B Jumonji/ARID domain-containing protein 1B KDM5B_HUMAN Lysine-specific demethylase 5B (KDM5Flag-5B-FL) PLU1 RBP2-H1 | Retinoblastoma-binding protein 2 homolog 1
Type:
Protein
Mol. Mass.:
175659.67
Organism:
Homo sapiens (Human)
Description:
Q9UGL1
Residue:
1544
  
Inhibitor
Name:
BDBM382056
Synonyms:
2-[1-(1,2,3,4- tetrahydronaphthalen-1- ylmethyl)imidadzol-4-yl]pyridine- 4-carboxylic acid | US10273222, Example 116
Type:
Small organic molecule
Emp. Form.:
C20H19N3O2
Mol. Mass.:
333.3838
SMILES:
OC(=O)c1ccnc(c1)-c1cn(CC2CCCc3ccccc23)cn1
: