Target
Histone deacetylase 4 [653-1084,H976Y]
Ligand
BDBM21709
Substrate
BDBM25143
Meas. Tech.
HDAC Activity Assay
Temperature
298.15±n/a K
IC50
4200±n/a nM
Comments
extracted
Citation
 Jones, PAltamura, SDe Francesco, RPaz, OGKinzel, OMesiti, GMonteagudo, EPescatore, GRowley, MVerdirame, MSteinkühler, C A novel series of potent and selective ketone histone deacetylase inhibitors with antitumor activity in vivo. J Med Chem 51:2350-3 (2008)  
Target
Name:
Histone deacetylase 4 [653-1084,H976Y]
Synonyms:
HDAC4 Histone Deacetylase 4 (HDAC4) Mutant (H976Y) KIAA0288
Type:
Catalytic domain
Mol. Mass.:
46476.72
Organism:
Homo sapiens (Human)
Description:
His-tagged HDAC4 GOF(gain of function, H976Y) catalytic domains (T653-L1084) was expressed in E.coli and purified by Nickel-Chelation affinity chromatography and anion exchange (MonoQ) chromatography.
Residue:
432
  
Inhibitor
Name:
BDBM21709
Synonyms:
2-ethyl-1-[(3R)-1-[(5-methoxy-1H-1,3-benzodiazol-2-yl)carbonyl]pyrrolidin-3-yl]-1H-1,3-benzodiazole | benzimidazole, 18
Type:
Small organic molecule
Emp. Form.:
C22H23N5O2
Mol. Mass.:
389.4503
SMILES:
CCc1nc2ccccc2n1[C@@H]1CCN(C1)C(=O)c1nc2ccc(OC)cc2[nH]1
:
Substrate
Name:
BDBM25143
Synonyms:
Fluor-de-Lys Fluorogenic Deacetylase Substrate | KI-104 (BioMol Research Laboratories)
Type:
Fluorogenic Substrate
Emp. Form.:
Mol. Mass.:
SMILES:
: