Target
Histone-lysine N-methyltransferase EZH2
Ligand
BDBM382207
Substrate
Meas. Tech.
Wild-Type PRC2 Enzyme Assay
IC50
<300±n/a nM
Citation
 Kuntz, KWOlhava, EJChesworth, RDuncan, KW Substituted 6,5-fused bicyclic heteroaryl compounds US Patent  US10273223 Publication Date 4/30/2019 
Target
Name:
Histone-lysine N-methyltransferase EZH2
Synonyms:
ENX-1 EZH2_HUMAN Histone-lysine N-methyltransferase EZH2 Lysine N-methyltransferase 6
Type:
Protein
Mol. Mass.:
85367.84
Organism:
Homo sapiens (Human)
Description:
Q15910
Residue:
746
  
Inhibitor
Name:
BDBM382207
Synonyms:
US10273223, Compound B-4
Type:
Small organic molecule
Emp. Form.:
C29H40N6O2
Mol. Mass.:
504.6669
SMILES:
Cc1cc(C)c(CNC(=O)c2cc(nc3n(ncc23)C2CCCC2)C2CC(C)(C)NC(C)(C)C2)c(=O)[nH]1
: