Target
G-protein coupled receptor 6
Ligand
BDBM382118
Substrate
Meas. Tech.
A.1 Inhibition of cAMP Activity of GPR6 In Vitro Assay
EC50
161000±n/a nM
Citation
 Adams, MEBrown, JWHitchcock, SHopkins, MKikuchi, SLam, BMonenschein, HReichard, HSun, H Pyrazines as modulators of GPR6 US Patent  US10273225 Publication Date 4/30/2019 
Target
Name:
G-protein coupled receptor 6
Synonyms:
G-protein coupled receptor 6 (GPR6) GPR6_HUMAN | Sphingosine 1-phosphate receptor GPR6
Type:
Protein
Mol. Mass.:
37886.39
Organism:
Homo sapiens (Human)
Description:
P46095
Residue:
362
  
Inhibitor
Name:
BDBM382118
Synonyms:
US10000468, Example 27 | US10273225, Example 27
Type:
Small organic molecule
Emp. Form.:
C19H21F2N5O
Mol. Mass.:
373.3997
SMILES:
CC(C)Nc1ncc(nc1N1CCC(CC1)Oc1ccc(F)cc1F)C#N
: