Target
Histone deacetylase 4 [653-1084,H976Y]
Ligand
BDBM25183
Substrate
BDBM25143
Meas. Tech.
HDAC Activity Assay
Temperature
298.15±n/a K
IC50
2900±n/a nM
Comments
extracted
Citation
 Jones, PBottomley, MJCarfí, ACecchetti, OFerrigno, FLo Surdo, POntoria, JMRowley, MScarpelli, RSchultz-Fademrecht, CSteinkühler, C 2-Trifluoroacetylthiophenes, a novel series of potent and selective class II histone deacetylase inhibitors. Bioorg Med Chem Lett 18:3456-61 (2008)  
Target
Name:
Histone deacetylase 4 [653-1084,H976Y]
Synonyms:
HDAC4 Histone Deacetylase 4 (HDAC4) Mutant (H976Y) KIAA0288
Type:
Catalytic domain
Mol. Mass.:
46476.72
Organism:
Homo sapiens (Human)
Description:
His-tagged HDAC4 GOF(gain of function, H976Y) catalytic domains (T653-L1084) was expressed in E.coli and purified by Nickel-Chelation affinity chromatography and anion exchange (MonoQ) chromatography.
Residue:
432
  
Inhibitor
Name:
BDBM25183
Synonyms:
N-(cyclohexylmethyl)-2-(2,2,2-trifluoroacetyl)-1,3-thiazole-5-carboxamide | thiazole derivative, 29g
Type:
Small organic molecule
Emp. Form.:
C13H15F3N2O2S
Mol. Mass.:
320.331
SMILES:
FC(F)(F)C(=O)c1ncc(s1)C(=O)NCC1CCCCC1
:
Substrate
Name:
BDBM25143
Synonyms:
Fluor-de-Lys Fluorogenic Deacetylase Substrate | KI-104 (BioMol Research Laboratories)
Type:
Fluorogenic Substrate
Emp. Form.:
Mol. Mass.:
SMILES:
: