Target
Ectonucleotide pyrophosphatase/phosphodiesterase family member 2
Ligand
BDBM382156
Substrate
Meas. Tech.
ATX biochemical assay
IC50
2750±n/a nM
Citation
 Guckian, KKumaravel, GMa, BSun, LXin, ZZhang, L Compounds that are S1P modulating agents and/or ATX modulating agents US Patent  US10273234 Publication Date 4/30/2019 
Target
Name:
Ectonucleotide pyrophosphatase/phosphodiesterase family member 2
Synonyms:
ATX Autotaxin (ATX) ENPP2 Ectonucleotide Pyrophosphatase/Phosphodiesterase 2 (ENPP2) Extracellular lysophospholipase D PDNP2
Type:
Enzyme
Mol. Mass.:
99007.13
Organism:
Homo sapiens (Human)
Description:
Q13822
Residue:
863
  
Inhibitor
Name:
BDBM382156
Synonyms:
1-((5-((trans-4-ethylcyclohexyl)oxy)naphthalen-2-yl)methyl)azetidine-3-carboxylic acid | US10273234, Example 19
Type:
Small organic molecule
Emp. Form.:
C23H29NO3
Mol. Mass.:
367.4813
SMILES:
CC[C@H]1CC[C@@H](CC1)Oc1cccc2cc(CN3CC(C3)C(O)=O)ccc12
: