Target
D(3) dopamine receptor
Ligand
BDBM50154850
Substrate
Meas. Tech.
Inhibition Assay
Ki
1.38±n/a nM
Citation
 Micheli, FCremonesi, SSemeraro, TTarsi, L Substituted hexahydropyrrolo[3,4-b]pyrroles and hexahydrocyclopenta[c]pyrroles as dopamine receptor modulators US Patent  US10273244 Publication Date 4/30/2019 
Target
Name:
D(3) dopamine receptor
Synonyms:
DOPAMINE D3 DRD3_HUMAN Dopamine D3 receptor (D3) Dopamine receptor Dopamine receptor D3
Type:
Mol. Mass.:
44243.43
Organism:
Homo sapiens (Human)
Description:
Residue:
400
  
Inhibitor
Name:
BDBM50154850
Synonyms:
CHEMBL3774588 US10584135, Example 22
Type:
Small organic molecule
Emp. Form.:
C22H27FN6OS
Mol. Mass.:
442.553
SMILES:
Cc1ncoc1-c1nnc(SCCCN2CC3CCN(C3C2)c2ccc(F)cc2)n1C
: