Target
D(2) dopamine receptor
Ligand
BDBM382343
Substrate
Meas. Tech.
Functional Calcium Assay
Ki
97.7±n/a nM
Citation
 Micheli, FCremonesi, SSemeraro, TTarsi, L Substituted hexahydropyrrolo[3,4-b]pyrroles and hexahydrocyclopenta[c]pyrroles as dopamine receptor modulators US Patent  US10273244 Publication Date 4/30/2019 
Target
Name:
D(2) dopamine receptor
Synonyms:
D(2) dopamine receptor DOPAMINE D2 Long DRD2 Dopamine D2 receptor Dopamine D2 receptor (D2R) Dopamine2-like | d2
Type:
Cell-surface receptors
Mol. Mass.:
50647.10
Organism:
Homo sapiens (Human)
Description:
P14416
Residue:
443
  
Inhibitor
Name:
BDBM382343
Synonyms:
US10273244, Example 233
Type:
Small organic molecule
Emp. Form.:
C24H29F3N6OS
Mol. Mass.:
506.587
SMILES:
Cc1ncoc1-c1nnc(SCCCN2C[C@H]3CCCN([C@H]3C2)c2ccc(cc2)C(F)(F)F)n1C
: