Target
Nuclear receptor ROR-gamma
Ligand
BDBM382380
Substrate
Meas. Tech.
General RORgamma SPA binding assay
IC50
20.0±n/a nM
Citation
 Duan, JDhar, TGMarcoux, DCherney, RJ Tricyclic sulfones as RORγ modulators US Patent  US10273259 Publication Date 4/30/2019 
Target
Name:
Nuclear receptor ROR-gamma
Synonyms:
Nr1f3 Nuclear receptor subfamily 1 group F member 3 RORG_MOUSE Rorc TOR Thymus orphan receptor
Type:
PROTEIN
Mol. Mass.:
58133.31
Organism:
Mus musculus
Description:
ChEMBL_103664
Residue:
516
  
Inhibitor
Name:
BDBM382380
Synonyms:
US10273259, Example 92 US10711020, Example 94
Type:
Small organic molecule
Emp. Form.:
C26H23F7N2O5S
Mol. Mass.:
608.525
SMILES:
CN1[C@@H](CCC1=O)C(=O)N1CCC2(C1COc1cc(ccc21)C(F)(C(F)(F)F)C(F)(F)F)S(=O)(=O)c1ccccc1
: