Target
Nuclear receptor ROR-gamma
Ligand
BDBM382759
Substrate
Meas. Tech.
General RORgamma SPA binding assay
IC50
22.0±n/a nM
Citation
 Duan, JDhar, TGMarcoux, DCherney, RJ Tricyclic sulfones as RORγ modulators US Patent  US10273259 Publication Date 4/30/2019 
Target
Name:
Nuclear receptor ROR-gamma
Synonyms:
Nr1f3 Nuclear receptor subfamily 1 group F member 3 RORG_MOUSE Rorc TOR Thymus orphan receptor
Type:
PROTEIN
Mol. Mass.:
58133.31
Organism:
Mus musculus
Description:
ChEMBL_103664
Residue:
516
  
Inhibitor
Name:
BDBM382759
Synonyms:
US10273259, Example 468 | US10711020, Example 468
Type:
Small organic molecule
Emp. Form.:
C28H27F8NO4S
Mol. Mass.:
625.571
SMILES:
OC1(CCCCC1)C(=O)N1CC[C@@]2([C@H]1CCc1cc(ccc21)C(F)(C(F)(F)F)C(F)(F)F)S(=O)(=O)c1ccc(F)cc1
: