Target
Nuclear receptor ROR-gamma
Ligand
BDBM382802
Substrate
Meas. Tech.
General RORgamma SPA binding assay
IC50
18.0±n/a nM
Citation
 Duan, JDhar, TGMarcoux, DCherney, RJ Tricyclic sulfones as RORγ modulators US Patent  US10273259 Publication Date 4/30/2019 
Target
Name:
Nuclear receptor ROR-gamma
Synonyms:
Nr1f3 Nuclear receptor subfamily 1 group F member 3 RORG_MOUSE Rorc TOR Thymus orphan receptor
Type:
PROTEIN
Mol. Mass.:
58133.31
Organism:
Mus musculus
Description:
ChEMBL_103664
Residue:
516
  
Inhibitor
Name:
BDBM382802
Synonyms:
US10273259, Example 513 US10711020, Example 522
Type:
Small organic molecule
Emp. Form.:
C26H22F9N3O4S
Mol. Mass.:
643.521
SMILES:
CN1[C@@H](C[C@H](F)C1=O)C(=O)N1CCC2(C1CNc1cc(ccc21)C(F)(C(F)(F)F)C(F)(F)F)S(=O)(=O)c1cccc(F)c1
: