Target
Nuclear receptor ROR-gamma
Ligand
BDBM382866
Substrate
Meas. Tech.
General RORgamma SPA binding assay
IC50
11.0±n/a nM
Citation
 Duan, JDhar, TGMarcoux, DCherney, RJ Tricyclic sulfones as RORγ modulators US Patent  US10273259 Publication Date 4/30/2019 
Target
Name:
Nuclear receptor ROR-gamma
Synonyms:
Nr1f3 Nuclear receptor subfamily 1 group F member 3 RORG_MOUSE Rorc TOR Thymus orphan receptor
Type:
PROTEIN
Mol. Mass.:
58133.31
Organism:
Mus musculus
Description:
ChEMBL_103664
Residue:
516
  
Inhibitor
Name:
BDBM382866
Synonyms:
US10273259, Example 577 | US10711020, Example 577
Type:
Small organic molecule
Emp. Form.:
C30H29F8NO4S
Mol. Mass.:
651.608
SMILES:
OC12CCCC(CCC1)(C2)C(=O)N1CCC2(C1Cc1cc(ccc21)C(F)(C(F)(F)F)C(F)(F)F)S(=O)(=O)c1ccc(F)cc1
: