Target
Ephrin type-B receptor 4
Ligand
BDBM25225
Substrate
biotinylated-polypeptide substrate
Meas. Tech.
In Vitro EphB4 Enzyme Inhibition Assay
pH
7.4±n/a
Temperature
295.15±n/a K
IC50
41000±n/a nM
Citation
 Bardelle, CCross, DDavenport, SKettle, JGKo, EJLeach, AGMortlock, ARead, JRoberts, NJRobins, PWilliams, EJ Inhibitors of the tyrosine kinase EphB4. Part 1: Structure-based design and optimization of a series of 2,4-bis-anilinopyrimidines. Bioorg Med Chem Lett 18:2776-80 (2008)  
Target
Name:
Ephrin type-B receptor 4
Synonyms:
EPHB4 Ephrin receptor HTK MYK1 Tyrosine-protein kinase TYRO11 | VHL/Ephrin type-B receptor 4
Type:
Enzyme
Mol. Mass.:
108273.51
Organism:
Homo sapiens (Human)
Description:
P54760
Residue:
987
  
Inhibitor
Name:
BDBM25225
Synonyms:
2,4-Pyrimidine derivative, 27 | 4-N-(5-chloro-2H-1,3-benzodioxol-4-yl)-2-N-(2-methanesulfonylphenyl)pyrimidine-2,4-diamine
Type:
Small organic molecule
Emp. Form.:
C18H15ClN4O4S
Mol. Mass.:
418.854
SMILES:
CS(=O)(=O)c1ccccc1Nc1nccc(Nc2c3OCOc3ccc2Cl)n1
:
Substrate
Name:
biotinylated-polypeptide substrate
Synonyms:
biotin-poly-GAT
Type:
random copolymer
Mol. Mass.:
358.43
Organism:
Description:
Residue:
3
NA