Target
Serine/threonine-protein kinase B-raf
Ligand
BDBM25381
Substrate
Dual specificity mitogen-activated protein kinase kinase 1
Meas. Tech.
In Vitro BRAF Kinase Assay
pH
7±n/a
Temperature
310.15±n/a K
Ki
106±n/a nM
IC50
1720±n/a nM
Citation
 Luo, CXie, PMarmorstein, R Identification of BRAF inhibitors through in silico screening. J Med Chem 51:6121-7 (2008)  
Target
Name:
Serine/threonine-protein kinase B-raf
Synonyms:
B-RAF B-Raf proto-oncogene serine/threonine-protein kinase BRAF1 RAFB1 v-Raf murine sarcoma viral oncogene homolog B1
Type:
Serine/threonine-protein kinase
Mol. Mass.:
84446.00
Organism:
Homo sapiens (Human)
Description:
P15056
Residue:
766
  
Inhibitor
Name:
BDBM25381
Synonyms:
1,7-dibenzyl-8-[(2-hydroxyethyl)sulfanyl]-3-methyl-2,3,6,7-tetrahydro-1H-purine-2,6-dione | purine-2,6-dione, 24
Type:
Small organic molecule
Emp. Form.:
C22H22N4O3S
Mol. Mass.:
422.5
SMILES:
Cn1c2nc(SCCO)n(Cc3ccccc3)c2c(=O)n(Cc2ccccc2)c1=O
:
Substrate
Name:
Dual specificity mitogen-activated protein kinase kinase 1
Synonyms:
GST fusion of MAP kinase kinase 1 MAP2K1 MP2K1_RABIT glutathione S-transferase-MAP kinase kinase 1
Type:
Other Protein Type
Mol. Mass.:
43453
Organism:
Oryctolagus cuniculus (rabbit)
Description:
Rabbit MEK1 was purchased from Millipore.
Residue:
393